BDBM162328 US9669028, 77 (6-(3-methyl-1H-pyrazolo[3,4-b]pyridin-5-yl)pyrazin-2-yl)(piperidin-1-yl)methanone
SMILES Cc1n[nH]c2ncc(cc12)-c1cncc(n1)C(=O)N1CCCCC1
InChI Key InChIKey=VSYBVYRURFUDHW-UHFFFAOYSA-N
Data  3 IC50
  Tab Delimited (TSV)   2D SDfile   Computed 3D by Vconf -m prep SDfile
Find this compound or compounds like it in BindingDB:
Activity Spreadsheet -- Enzyme Inhibition Constant Data from BindingDB
Found 1 hit for monomerid = 162328
TargetLeucine-rich repeat serine/threonine-protein kinase 2(Homo sapiens (Human))
Arrien Pharmaceuticals
US Patent
LigandPNGBDBM162328(US9669028, 77 (6-(3-methyl-1H-pyrazolo[3,4-b]pyrid...)
Affinity DataIC50: >500nM. Assay description: Procedure: Enzyme was incubated with substrate peptide in reaction buffer in the presence and absence of test compounds or Staurosporine. All additio...
Ligand InfoPC cidPC sid
In DepthDetails US Patent